{"text_format":"1","workbook":"xlsx","n_sheets":5,"sheets":["Game Board","GAME1","GAME2","GAME3","GAME4"],"not_rendered":{"charts":4,"images":40,"macros":1,"external_links":0,"defined_names":36,"comments":0,"pivot_tables":0},"unopened":[],"bounds":{"document_bytes":16777216,"sheet_cells":100000,"rows_first":2000,"rows_last":500,"rows_between":2000,"halvings":0,"cell_chars":16384,"cell_head_chars":4096},"cells_cut":0,"cells_raw":0,"read":"whole","date_system":"1900"}

{"sheet":"Game Board","index":0,"n_rows":29,"n_cols":34,"rows_kept":29,"cut":false,"hidden":false,"merged":[[18,23,19,23],[18,11,19,11],[18,17,19,17],[18,29,19,29],[15,4,15,5]]}
[]
[null,null,null,null,"Blank"]
[null,null,null,null,"Small",null,null,"P",null,null,null,null,{"$f":"IF(M2=\"P\",M5+100,\"\")","v":""},{"$f":"IF(N2=\"P\",N5+100,\"\")","v":""},{"$f":"IF(O2=\"P\",O5+100,\"\")","v":""},null,null,null,{"$f":"IF(S2=\"P\",S5+100,\"\")","v":""},{"$f":"IF(T2=\"P\",T5+100,\"\")","v":""},{"$f":"IF(U2=\"P\",U5+100,\"\")","v":""},null,null,null,{"$f":"IF(Y2=\"P\",Y5+100,\"\")","v":""},{"$f":"IF(Z2=\"P\",Z5+100,\"\")","v":""},{"$f":"IF(AA2=\"P\",AA5+100,\"\")","v":""},null,null,null,{"$f":"IF(AE2=\"P\",AE5+100,\"\")","v":""},{"$f":"IF(AF2=\"P\",AF5+100,\"\")","v":""},{"$f":"IF(AG2=\"P\",AG5+100,\"\")","v":""}]
[null,null,null,null,"Medium"]
[null,null,null,null,"High",null,null,null,null,null,null,"TOPLINE:",{"$f":"SUM(M6:M8)","v":60},{"$f":"SUM(N6:N8)","v":20},{"$f":"SUM(O6:O8)","v":-20},{"$f":"SUM(P6:P8)","v":-60},null,"TOPLINE:",{"$f":"SUM(S6:S8)","v":60},{"$f":"SUM(T6:T8)","v":20},{"$f":"SUM(U6:U8)","v":-20},{"$f":"SUM(V6:V8)","v":-60},null,"TOPLINE:",{"$f":"SUM(Y6:Y8)","v":60},{"$f":"SUM(Z6:Z8)","v":20},{"$f":"SUM(AA6:AA8)","v":-20},{"$f":"SUM(AB6:AB8)","v":-60},null,"TOPLINE:",{"$f":"SUM(AE6:AE8)","v":60},{"$f":"SUM(AF6:AF8)","v":20},{"$f":"SUM(AG6:AG8)","v":-20},{"$f":"SUM(AH6:AH8)","v":-60}]
[null,null,null,null,null,null,null,null,null,null,null,"START:",{"$f":"$E$16","v":100},{"$f":"IF(M2=\"P\",(M3)-(M3*0.1),M5)","v":60},{"$f":"IF(N2=\"P\",(N3)-(N3*0.1),N5)","v":20},{"$f":"IF(O2=\"P\",(O3)-(O3*0.1),O5)","v":-20},null,"START:",{"$f":"$E$16","v":100},{"$f":"IF(S2=\"P\",(S3)-(S3*0.1),S5)","v":60},{"$f":"IF(T2=\"P\",(T3)-(T3*0.1),T5)","v":20},{"$f":"IF(U2=\"P\",(U3)-(U3*0.1),U5)","v":-20},null,"START:",{"$f":"$E$16","v":100},{"$f":"IF(Y2=\"P\",(Y3)-(Y3*0.1),Y5)","v":60},{"$f":"IF(Z2=\"P\",(Z3)-(Z3*0.1),Z5)","v":20},{"$f":"IF(AA2=\"P\",(AA3)-(AA3*0.1),AA5)","v":-20},null,"START:",{"$f":"$E$16","v":100},{"$f":"IF(AE2=\"P\",(AE3)-(AE3*0.1),AE5)","v":60},{"$f":"IF(AF2=\"P\",(AF3)-(AF3*0.1),AF5)","v":20},{"$f":"IF(AG2=\"P\",(AG3)-(AG3*0.1),AG5)","v":-20}]
[null,null,{"$f":"RANDBETWEEN(1,6)","v":5},null,null,null,{"$f":"RANDBETWEEN(1,6)","v":4},null,null,null,null,"RECURRING:",{"$f":"SUM(O23:O24,P29)","v":-40},{"$f":"(M7)","v":-40},{"$f":"(N7)","v":-40},{"$f":"(O7)","v":-40},null,"RECURRING:",{"$f":"SUM(U23:U24,V29)","v":-40},{"$f":"S7","v":-40},{"$f":"T7","v":-40},{"$f":"U7","v":-40},null,"RECURRING:",{"$f":"SUM(AA23:AA24, AB29)","v":-40},{"$f":"Y7","v":-40},{"$f":"Z7","v":-40},{"$f":"AA7","v":-40},null,"RECURRING:",{"$f":"SUM(AG23:AG24,AH29)","v":-40},{"$f":"AE7","v":-40},{"$f":"AF7","v":-40},{"$f":"AG7","v":-40}]
[null,null,{"$f":"IF(OR(C7=2,C7=3,C7=4,C7=5,C7=6),\"l\",\"\")","v":"l"},null,{"$f":"IF(OR(C7=4,C7=5,C7=6),\"l\",\"\")","v":"l"},null,{"$f":"IF(OR(G7=2,G7=3,G7=4,G7=5,G7=6),\"l\",\"\")","v":"l"},null,{"$f":"IF(OR(G7=4,G7=5,G7=6),\"l\",\"\")","v":"l"},null,null,"ACTIVITY:",{"$f":"IF(OR($M$17=\"J\",$M$17=\"I\",$M$17=\"D\",$M$17=\"B\",$M$17=\"A\"),100,IF($M$17=\"E\",\"\",IF($M$17=\"A\",100,IF($M$17=\"Blank\",\"\",\"-100\"))))","v":""},{"$f":"IF(OR($N$17=\"J\",$N$17=\"I\",$N$17=\"D\",$N$17=\"B\",$N$17=\"A\"),100,IF($N$17=\"E\",\"\",IF($N$17=\"A\",200,IF($N$17=\"Blank\",\"\",-100))))","v":""},{"$f":"IF(OR($O$17=\"I\",$O$17=\"G\",$O$17=\"D\",$O$17=\"A\"),300,IF($O$17=\"J\",50,IF($O$17=\"H\",-100,IF($O$17=\"F\",-100,IF($O$17=\"E\",\"\",IF($O$17=\"C\",-100,IF($O$17=\"Blank\",\"\",-100)))))))","v":""},{"$f":"IF(OR($P$17=\"I\",$P$17=\"D\"),100,IF($P$17=\"J\",50,IF($P$17=\"H\",-100,IF($P$17=\"G\",-100,IF($P$17=\"F\",-200,IF($P$17=\"E\",\"\",IF($P$17=\"C\",-100,IF($P$17=\"A\",300,IF($P$17=\"Blank\",\"\",\"\")))))))))","v":""},null,"ACTIVITY:",{"$f":"IF(OR($S$17=\"J\",$S$17=\"I\",$S$17=\"H\",$S$17=\"G\",$S$17=\"F\",$S$17=\"E\",$S$17=\"D\",$S$17=\"C\"),-100,IF($S$17=\"B\",100,IF($S$17=\"A\",100,IF($S$17=\"Blank\",\"\",\"\"))))","v":""},{"$f":"IF(OR($T$17=\"H\",$T$17=\"G\",$T$17=\"F\",$T$17=\"E\",$T$17=\"C\"),-100,IF($T$17=\"J\",100,IF($T$17=\"I\",100,IF($T$17=\"D\",100,IF($T$17=\"B\",100,IF($T$17=\"A\",200,IF($T$17=\"Blank\",\"\",\"\")))))))","v":""},{"$f":"IF(OR($U$17=\"H\",$U$17=\"F\",$U$17=\"E\",$U$17=\"C\"),-100,IF($U$17=\"J\",50,IF($U$17=\"I\",100,IF($U$17=\"G\",100,IF($U$17=\"D\",100,IF($U$17=\"A\",300,IF($U$17=\"Blank\",\"\",\"\")))))))","v":""},{"$f":"IF(OR($V$17=\"H\",$V$17=\"G\",$V$17=\"E\",$V$17=\"C\"),-100,IF($V$17=\"J\",50,IF($V$17=\"I\",100,IF($V$17=\"F\",-200,IF($V$17=\"D\",100,IF($V$17=\"A\",300,IF($V$17=\"Blank\",\"\",\"\")))))))","v":""},null,"ACTIVITY:",{"$f":"IF(OR($Y$17=\"J\",$Y$17=\"I\",$Y$17=\"H\",$Y$17=\"G\",$Y$17=\"F\",$Y$17=\"E\",$Y$17=\"D\",$Y$17=\"C\"),-100,IF($Y$17=\"B\",100,IF($Y$17=\"A\",100,IF($Y$17=\"Blank\",\"\",\"\"))))","v":""},{"$f":"IF(OR($Z$17=\"H\",$Z$17=\"G\",$Z$17=\"F\",$Z$17=\"E\",$Z$17=\"C\"),-100,IF($Z$17=\"J\",100,IF($Z$17=\"I\",100,IF($Z$17=\"D\",100,IF($Z$17=\"B\",100,IF($Z$17=\"A\",200,IF($Z$17=\"Blank\",\"\",\"\")))))))","v":""},{"$f":"IF(OR($AA$17=\"H\",$AA$17=\"F\",$AA$17=\"E\",$AA$17=\"C\"),-100,IF($AA$17=\"J\",50,IF($AA$17=\"I\",100,IF($AA$17=\"G\",100,IF($AA$17=\"D\",100,IF($AA$17=\"A\",300,IF($AA$17=\"Blank\",\"\",\"\")))))))","v":""},{"$f":"IF(OR($AB$17=\"H\",$AB$17=\"G\",$AB$17=\"E\",$AB$17=\"C\"),-100,IF($AB$17=\"J\",50,IF($AB$17=\"I\",100,IF($AB$17=\"F\",-200,IF($AB$17=\"D\",100,IF($AB$17=\"A\",300,IF($AB$17=\"Blank\",\"\",\"\")))))))","v":""},null,"ACTIVITY:"]
[null,null,{"$f":"IF(C7=6,\"l\",\"\")","v":""},{"$f":"IF(OR(C7=1,C7=3,C7=5),\"l\",\"\")","v":"l"},{"$f":"IF(C7=6,\"l\",\"\")","v":""},null,{"$f":"IF(G7=6,\"l\",\"\")","v":""},{"$f":"IF(OR(G7=1,G7=3,G7=5),\"l\",\"\")","v":""},{"$f":"IF(G7=6,\"l\",\"\")","v":""}]
[null,null,{"$f":"IF(OR(C7=4,C7=5,C7=6),\"l\",\"\")","v":"l"},null,{"$f":"IF(OR(C7=2,C7=3,C7=4,C7=5,C7=6),\"l\",\"\")","v":"l"},null,{"$f":"IF(OR(G7=4,G7=5,G7=6),\"l\",\"\")","v":"l"},null,{"$f":"IF(OR(G7=2,G7=3,G7=4,G7=5,G7=6),\"l\",\"\")","v":"l"}]
[]
[]
[]
[]
[null,null,null,null,null,null,null,null,null,null,null,null,"Q1","Q2","Q3","Q4",null,null,"Q1","Q2","Q3","Q4",null,null,"Q1","Q2","Q3","Q4",null,null,"Q1","Q2","Q3","Q4"]
[null,null,null,"START:",100]
[null,null,null,null,null,null,null,null,null,null,null,null,{"$f":"IF($M$16>=11,\"J\",IF($M$16=10,\"I\",IF($M$16=9,\"H\",IF($M$16=8,\"G\",IF($M$16=7,\"F\",IF($M$16=6,\"E\",IF($M$16=5,\"D\",IF($M$16=4,\"C\",IF($M$16=3,\"B\",IF($M$16=2,\"A\",\"Blank\"))))))))))","v":"Blank"},{"$f":"IF($N$16>=11,\"J\",IF($N$16=10,\"I\",IF($N$16=9,\"H\",IF($N$16=8,\"G\",IF($N$16=7,\"F\",IF($N$16=6,\"E\",IF($N$16=5,\"D\",IF($N$16=4,\"C\",IF($N$16=3,\"B\",IF($N$16=2,\"A\",\"Blank\"))))))))))","v":"Blank"},{"$f":"IF($O$16>=11,\"J\",IF($O$16=10,\"I\",IF($O$16=9,\"H\",IF($O$16=8,\"G\",IF($O$16=7,\"F\",IF($O$16=6,\"E\",IF($O$16=5,\"D\",IF($O$16=4,\"C\",IF($O$16=3,\"B\",IF($O$16=2,\"A\",\"Blank\"))))))))))","v":"Blank"},{"$f":"IF($P$16>=11,\"J\",IF($P$16=10,\"I\",IF($P$16=9,\"H\",IF($P$16=8,\"G\",IF($P$16=7,\"F\",IF($P$16=6,\"E\",IF($P$16=5,\"D\",IF($P$16=4,\"C\",IF($P$16=3,\"B\",IF($P$16=2,\"A\",\"Blank\"))))))))))","v":"Blank"},null,null,{"$f":"IF($S$16>=11,\"J\",IF($S$16=10,\"I\",IF($S$16=9,\"H\",IF($S$16=8,\"G\",IF($S$16=7,\"F\",IF($S$16=6,\"E\",IF($S$16=5,\"D\",IF($S$16=4,\"C\",IF($S$16=3,\"B\",IF($S$16=2,\"A\",\"Blank\"))))))))))","v":"Blank"},{"$f":"IF($T$16>=11,\"J\",IF($T$16=10,\"I\",IF($T$16=9,\"H\",IF($T$16=8,\"G\",IF($T$16=7,\"F\",IF($T$16=6,\"E\",IF($T$16=5,\"D\",IF($T$16=4,\"C\",IF($T$16=3,\"B\",IF($T$16=2,\"A\",\"Blank\"))))))))))","v":"Blank"},{"$f":"IF($U$16>=11,\"J\",IF($U$16=10,\"I\",IF($U$16=9,\"H\",IF($U$16=8,\"G\",IF($U$16=7,\"F\",IF($U$16=6,\"E\",IF($U$16=5,\"D\",IF($U$16=4,\"C\",IF($U$16=3,\"B\",IF($U$16=2,\"A\",\"Blank\"))))))))))","v":"Blank"},{"$f":"IF($V$16>=11,\"J\",IF($V$16=10,\"I\",IF($V$16=9,\"H\",IF($V$16=8,\"G\",IF($V$16=7,\"F\",IF($V$16=6,\"E\",IF($V$16=5,\"D\",IF($V$16=4,\"C\",IF($V$16=3,\"B\",IF($V$16=2,\"A\",\"Blank\"))))))))))","v":"Blank"},null,null,{"$f":"IF($Y$16>=11,\"J\",IF($Y$16=10,\"I\",IF($Y$16=9,\"H\",IF($Y$16=8,\"G\",IF($Y$16=7,\"F\",IF($Y$16=6,\"E\",IF($Y$16=5,\"D\",IF($Y$16=4,\"C\",IF($Y$16=3,\"B\",IF($Y$16=2,\"A\",\"Blank\"))))))))))","v":"Blank"},{"$f":"IF($Z$16>=11,\"J\",IF($Z$16=10,\"I\",IF($Z$16=9,\"H\",IF($Z$16=8,\"G\",IF($Z$16=7,\"F\",IF($Z$16=6,\"E\",IF($Z$16=5,\"D\",IF($Z$16=4,\"C\",IF($Z$16=3,\"B\",IF($Z$16=2,\"A\",\"Blank\"))))))))))","v":"Blank"},{"$f":"IF($AA$16>=11,\"J\",IF($AA$16=10,\"I\",IF($AA$16=9,\"H\",IF($AA$16=8,\"G\",IF($AA$16=7,\"F\",IF($AA$16=6,\"E\",IF($AA$16=5,\"D\",IF($AA$16=4,\"C\",IF($AA$16=3,\"B\",IF($AA$16=2,\"A\",\"Blank\"))))))))))","v":"Blank"},{"$f":"IF($AB$16>=11,\"J\",IF($AB$16=10,\"I\",IF($AB$16=9,\"H\",IF($AB$16=8,\"G\",IF($AB$16=7,\"F\",IF($AB$16=6,\"E\",IF($AB$16=5,\"D\",IF($AB$16=4,\"C\",IF($AB$16=3,\"B\",IF($AB$16=2,\"A\",\"Blank\"))))))))))","v":"Blank"},null,null,{"$f":"IF($AE$16>=11,\"J\",IF($AE$16=10,\"I\",IF($AE$16=9,\"H\",IF($AE$16=8,\"G\",IF($AE$16=7,\"F\",IF($AE$16=6,\"E\",IF($AE$16=5,\"D\",IF($AE$16=4,\"C\",IF($AE$16=3,\"B\",IF($AE$16=2,\"A\",\"Blank\"))))))))))","v":"Blank"},{"$f":"IF($AF$16>=11,\"J\",IF($AF$16=10,\"I\",IF($AF$16=9,\"H\",IF($AF$16=8,\"G\",IF($AF$16=7,\"F\",IF($AF$16=6,\"E\",IF($AF$16=5,\"D\",IF($AF$16=4,\"C\",IF($AF$16=3,\"B\",IF($AF$16=2,\"A\",\"Blank\"))))))))))","v":"Blank"},{"$f":"IF($AG$16>=11,\"J\",IF($AG$16=10,\"I\",IF($AG$16=9,\"H\",IF($AG$16=8,\"G\",IF($AG$16=7,\"F\",IF($AG$16=6,\"E\",IF($AG$16=5,\"D\",IF($AG$16=4,\"C\",IF($AG$16=3,\"B\",IF($AG$16=2,\"A\",\"Blank\"))))))))))","v":"Blank"},{"$f":"IF($AH$16>=11,\"J\",IF($AH$16=10,\"I\",IF($AH$16=9,\"H\",IF($AH$16=8,\"G\",IF($AH$16=7,\"F\",IF($AH$16=6,\"E\",IF($AH$16=5,\"D\",IF($AH$16=4,\"C\",IF($AH$16=3,\"B\",IF($AH$16=2,\"A\",\"Blank\"))))))))))","v":"Blank"}]
[]
[]
[]
[null,null,null,null,null,null,null,null,null,null,null,null,null,"TEAM:",null,null,null,null,null,"TEAM: ",null,null,null,null,null,"TEAM:",null,null,null,null,null,"TEAM:"]
[]
[null,null,null,null,null,null,null,null,null,null,null,null,"SALARY:","Blank",{"$f":"IF($N$23=\"\",0,IF($N$23=\"Small\",-5,IF($N$23=\"Medium\",-10,-20)))","v":-20},null,null,null,"SALARY:","Blank",{"$f":"IF($T$23=\"\",0,IF($T$23=\"Small\",-5,IF($T$23=\"Medium\",-10,-20)))","v":-20},null,null,null,"SALARY:","Blank",{"$f":"IF($Z$23=\"\",0,IF($Z$23=\"Small\",-5,IF($Z$23=\"Medium\",-10,-20)))","v":-20},null,null,null,"SALARY:","Blank",{"$f":"IF($AF$23=\"\",0,IF($AF$23=\"Small\",-5,IF($AF$23=\"Medium\",-10,-20)))","v":-20}]
[null,null,null,null,null,null,null,null,null,null,null,null,"RECURRING:","Blank",{"$f":"IF($N$24=\"\",0,IF($N$24=\"Small\",-5,IF($N$24=\"Medium\",-10,-20)))","v":-20},null,null,null,"RECURRING:","Blank",{"$f":"IF($T$24=\"\",0,IF($T$24=\"Small\",-5,IF($T$24=\"Medium\",-10,-20)))","v":-20},null,null,null,"RECURRING:","Blank",{"$f":"IF($Z$24=\"\",0,IF($Z$24=\"Small\",-5,IF($Z$24=\"Medium\",-10,-20)))","v":-20},null,null,null,"RECURRING:","Blank",{"$f":"IF($AF$24=\"\",0,IF($AF$24=\"Small\",-5,IF($AF$24=\"Medium\",-10,-20)))","v":-20}]
[]
[null,null,null,null,null,null,null,null,null,null,null,null,null,null,null,null,"  "]
[]
[null,null,null,null,null,null,null,null,null,null,null,null,"Blank","Blank","Blank",null,null,null,"Blank","Blank","Blank",null,null,null,"Blank","Blank","Blank",null,null,null,"Blank","Blank","Blank"]
[null,null,null,null,null,null,null,null,null,null,null,null,{"$f":"IF($M$28=\"Blank\",0,IF($M$28=\"Small\",-5,IF($M$28=\"Medium\",-10,-20)))","v":0},{"$f":"IF($N$28=\"Blank\",0,IF($N$28=\"Small\",-5,IF($N$28=\"Medium\",-10,-20)))","v":0},{"$f":"IF($O$28=\"Blank\",0,IF($O$28=\"Small\",-5,IF($O$28=\"Medium\",-10,-20)))","v":0},{"$f":"SUM(M29:O29)","v":0},null,null,{"$f":"IF($S$28=\"Blank\",0,IF($S$28=\"Small\",-5,IF($S$28=\"Medium\",-10,-20)))","v":0},{"$f":"IF($T$28=\"Blank\",0,IF($T$28=\"Small\",-5,IF($T$28=\"Medium\",-10,-20)))","v":0},{"$f":"IF($U$28=\"Blank\",0,IF($U$28=\"Small\",-5,IF($U$28=\"Medium\",-10,-20)))","v":0},{"$f":"SUM(S29:U29)","v":0},null,null,{"$f":"IF($Y$28=\"Blank\",0,IF($Y$28=\"Small\",-5,IF($Y$28=\"Medium\",-10,-20)))","v":0},{"$f":"IF($Z$28=\"Blank\",0,IF($Z$28=\"Small\",-5,IF($Z$28=\"Medium\",-10,-20)))","v":0},{"$f":"IF($AA$28=\"Blank\",0,IF($AA$28=\"Small\",-5,IF($AA$28=\"Medium\",-10,-20)))","v":0},{"$f":"SUM(Y29:AA29)","v":0},null,null,{"$f":"IF($AE$28=\"Blank\",0,IF($AE$28=\"Small\",-5,IF($AE$28=\"Medium\",-10,-20)))","v":0},{"$f":"IF($AF$28=\"Blank\",0,IF($AF$28=\"Small\",-5,IF($AF$28=\"Medium\",-10,-20)))","v":0},{"$f":"IF($AG$28=\"Blank\",0,IF($AG$28=\"Small\",-5,IF($AG$28=\"Medium\",-10,-20)))","v":0},{"$f":"SUM(AE29:AG29)","v":0}]

{"sheet":"GAME1","index":1,"n_rows":25,"n_cols":14,"rows_kept":25,"cut":false,"hidden":true,"merged":[]}
[]
[]
[]
[]
[]
[null,"Q1",null,null,"Q2",null,null,"Q3",null,null,"Q4"]
[]
[null,"J",null,null,"J",null,null,"J",null,null,"J"]
[null,"I",null,null,"I",null,null,"I",null,null,"I"]
[null,"H",null,null,"H",null,null,"H",null,null,"H"]
[null,"G",null,null,"G",null,null,"G",null,null,"G"]
[null,"F",null,null,"F",null,null,"F",null,null,"F"]
[null,"E",null,null,"E",null,null,"E",null,null,"E"]
[null,"D",null,null,"D",null,null,"D",null,null,"D"]
[null,"C",null,null,"C",null,null,"C",null,null,"C"]
[null,"B",null,null,"B",null,null,"B",null,null,"B"]
[null,"A",null,null,"A",null,null,"A",null,null,"A"]
[null,"Blank",null,null,"Blank",null,null,"Blank",null,null,"Blank"]
[]
[]
[]
[null,null,null,null,null,null,null,null,null,null,null,null,null,"Small"]
[null,null,null,null,null,null,null,null,null,null,null,null,null,"Medium"]
[null,null,null,null,null,null,null,null,null,null,null,null,null,"High"]
[null,null,null,null,null,null,null,null,null,null,null,null,null,"Blank"]

{"sheet":"GAME2","index":2,"n_rows":18,"n_cols":11,"rows_kept":18,"cut":false,"hidden":true,"merged":[]}
[]
[]
[]
[]
[]
[null,"Q1",null,null,"Q2",null,null,"Q3",null,null,"Q4"]
[]
[null,"J",null,null,"J",null,null,"J",null,null,"J"]
[null,"I",null,null,"I",null,null,"I",null,null,"I"]
[null,"H",null,null,"H",null,null,"H",null,null,"H"]
[null,"G",null,null,"G",null,null,"G",null,null,"G"]
[null,"F",null,null,"F",null,null,"F",null,null,"F"]
[null,"E",null,null,"E",null,null,"E",null,null,"E"]
[null,"D",null,null,"D",null,null,"D",null,null,"D"]
[null,"C",null,null,"C",null,null,"C",null,null,"C"]
[null,"B",null,null,"B",null,null,"B",null,null,"B"]
[null,"A",null,null,"A",null,null,"A",null,null,"A"]
[null,"Blank",null,null,"Blank",null,null,"Blank",null,null,"Blank"]

{"sheet":"GAME3","index":3,"n_rows":18,"n_cols":11,"rows_kept":18,"cut":false,"hidden":true,"merged":[]}
[]
[]
[]
[]
[]
[null,"Q1",null,null,"Q2",null,null,"Q3",null,null,"Q4"]
[]
[null,"J",null,null,"J",null,null,"J",null,null,"J"]
[null,"I",null,null,"I",null,null,"I",null,null,"I"]
[null,"H",null,null,"H",null,null,"H",null,null,"H"]
[null,"G",null,null,"G",null,null,"G",null,null,"G"]
[null,"F",null,null,"F",null,null,"F",null,null,"F"]
[null,"E",null,null,"E",null,null,"E",null,null,"E"]
[null,"D",null,null,"D",null,null,"D",null,null,"D"]
[null,"C",null,null,"C",null,null,"C",null,null,"C"]
[null,"B",null,null,"B",null,null,"B",null,null,"B"]
[null,"A",null,null,"A",null,null,"A",null,null,"A"]
[null,"Blank",null,null,"Blank",null,null,"Blank",null,null,"Blank"]

{"sheet":"GAME4","index":4,"n_rows":18,"n_cols":11,"rows_kept":18,"cut":false,"hidden":true,"merged":[]}
[]
[]
[]
[]
[]
[null,"Q1",null,null,"Q2",null,null,"Q3",null,null,"Q4"]
[]
[null,"J",null,null,"J",null,null,"J",null,null,"J"]
[null,"I",null,null,"I",null,null,"I",null,null,"I"]
[null,"H",null,null,"H",null,null,"H",null,null,"H"]
[null,"G",null,null,"G",null,null,"G",null,null,"G"]
[null,"F",null,null,"F",null,null,"F",null,null,"F"]
[null,"E",null,null,"E",null,null,"E",null,null,"E"]
[null,"D",null,null,"D",null,null,"D",null,null,"D"]
[null,"C",null,null,"C",null,null,"C",null,null,"C"]
[null,"B",null,null,"B",null,null,"B",null,null,"B"]
[null,"A",null,null,"A",null,null,"A",null,null,"A"]
[null,"Blank",null,null,"Blank",null,null,"Blank",null,null,"Blank"]